running 1 test Object : OK Object superclass : ERROR: Cannot found name: BasicObject OK: 1, FAIL: 0, ERROR: 1, WARN: 0, SKIP: 0, STRESS: 0 thread 'spec_object' (2535) panicked at mrubyedge/tests/mruby_spec/mod.rs:78:5: object.rb: upstream assertions failed note: run with `RUST_BACKTRACE=1` environment variable to display a backtrace test spec_object ... FAILED failures: failures: spec_object test result: FAILED. 0 passed; 1 failed; 0 ignored; 0 measured; 49 filtered out; finished in 0.00s