running 1 test Numeric : ERROR: Cannot found name: Numeric Numeric#+@ : OK Numeric#-@ : ERROR: Method not found: undefined method `const_defined?` for Class Numeric#abs : ERROR: Method not found: undefined method `const_defined?` for Class Numeric#/ : ERROR: Cannot found name: Numeric Numeric#** : ERROR: Method not found: undefined method `const_defined?` for Class Numeric#step : assertion failed: ERROR: [Internal Error] register 26 is not assigned OK: 1, FAIL: 0, ERROR: 6, WARN: 0, SKIP: 0, STRESS: 0 thread 'spec_numeric' (2533) panicked at mrubyedge/tests/mruby_spec/mod.rs:78:5: numeric.rb: upstream assertions failed note: run with `RUST_BACKTRACE=1` environment variable to display a backtrace test spec_numeric ... FAILED failures: failures: spec_numeric test result: FAILED. 0 passed; 1 failed; 0 ignored; 0 measured; 49 filtered out; finished in 0.00s