running 1 test NoMethodError : OK NoMethodError#args : ERROR: Method not found: undefined method `args` for NoMethodError OK: 1, FAIL: 0, ERROR: 1, WARN: 0, SKIP: 0, STRESS: 0 thread 'spec_nomethoderror' (2531) panicked at mrubyedge/tests/mruby_spec/mod.rs:78:5: nomethoderror.rb: upstream assertions failed note: run with `RUST_BACKTRACE=1` environment variable to display a backtrace test spec_nomethoderror ... FAILED failures: failures: spec_nomethoderror test result: FAILED. 0 passed; 1 failed; 0 ignored; 0 measured; 49 filtered out; finished in 0.00s