running 1 test thread 'spec_float' (2490) panicked at mrubyedge/tests/mruby_spec/mod.rs:52:9: float.rb: error nr NoMethodError("undefined method `const_defined?` for Class"); backtrace: [] note: run with `RUST_BACKTRACE=1` environment variable to display a backtrace test spec_float ... FAILED failures: failures: spec_float test result: FAILED. 0 passed; 1 failed; 0 ignored; 0 measured; 49 filtered out; finished in 0.01s