running 1 test Comparable#< : ERROR: Cannot found name: Comparable Comparable#<= : ERROR: Cannot found name: Comparable Comparable#== : ERROR: Cannot found name: Comparable Comparable#> : ERROR: Cannot found name: Comparable Comparable#>= : ERROR: Cannot found name: Comparable Comparable#between? : ERROR: Cannot found name: Comparable Comparable#between? - a comparison with no answer : ERROR: Class#new must be called from class OK: 0, FAIL: 0, ERROR: 7, WARN: 0, SKIP: 0, STRESS: 0 thread 'spec_comparable' (2468) panicked at mrubyedge/tests/mruby_spec/mod.rs:78:5: comparable.rb: upstream assertions failed note: run with `RUST_BACKTRACE=1` environment variable to display a backtrace test spec_comparable ... FAILED failures: failures: spec_comparable test result: FAILED. 0 passed; 1 failed; 0 ignored; 0 measured; 49 filtered out; finished in 0.00s