running 1 test thread 'spec_codegen' (2466) panicked at mrubyedge/src/yamrb/vm.rs:1009:50: called `Result::unwrap()` on an `Err` value: InvalidOpCode note: run with `RUST_BACKTRACE=1` environment variable to display a backtrace test spec_codegen ... FAILED failures: failures: spec_codegen test result: FAILED. 0 passed; 1 failed; 0 ignored; 0 measured; 49 filtered out; finished in 0.01s